Fix software and app installation error in windows pc

Click here for more detail..

ms fix-it 9740817,
Error: “Something Happened 0x80070005-0x90002”
error 1603: A fatal error occurred during installation,
Error: 0xC1900101-0x20017, -0x30018, -0x20004 and others, MsiExec.exe and InstMsi.exe Error Messages
0x80073712, 0x800F0923, 0x80200056, 0x800F0922, 0xC1900208 – 0x4000C, 0xC1900200 – 0x20008, 0xC1900202 – 0x20008,0x80070070 – 0x50011,0x80070070 – 0x50012,0x80070070 – 0x60000,
ERROR_INSTALL_SERVICE_
FAILURE 1601 The Windows Installer service could not be
accessed. Contact your support personnel
to verify that the Windows Installer
service is properly registered.
ERROR_INSTALL_USEREXIT 1602 User cancel installation.
ERROR_INSTALL_FAILURE 1603 Fatal error during installation.
ERROR_INSTALL_SUSPEND 1604 Installation suspended, incomplete.
ERROR_UNKNOWN_PRODUCT 1605 This action is only valid for products that
are currently installed.
ERROR_UNKNOWN_FEATURE 1606 Feature ID not registered.
ERROR_UNKNOWN_COMPONENT 1607 Component ID not registered.
ERROR_UNKNOWN_PROPERTY 1608 Unknown property.
ERROR_INVALID_HANDLE_
STATE 1609 Handle is in an invalid state.
ERROR_BAD_CONFIGURATION 1610 The configuration data for this product is
corrupt. Contact your support personnel.
ERROR_INDEX_ABSENT 1611 Component qualifier not present.
ERROR_INSTALL_SOURCE_
ABSENT 1612 The installation source for this product
is not available. Verify that the source
exists and that you can access it.
ERROR_INSTALL_PACKAGE_
VERSION 1613 This installation package cannot be
installed by the Windows Installer
service. You must install a Windows
service pack that contains a newer version
of the Windows Installer service.
ERROR_PRODUCT_
UNINSTALLED 1614 Product is uninstalled.
ERROR_BAD_QUERY_SYNTAX 1615 SQL query syntax invalid or unsupported.
ERROR_INVALID_FIELD 1616 Record field does not exist.
ERROR_INSTALL_ALREADY_
RUNNING 1618 Another installation is already in
progress. Complete that installation
before proceeding with this install.
ERROR_INSTALL_PACKAGE_
OPEN_FAILED 1619 This installation package could not be
opened. Verify that the package exists and
that you can access it, or contact the
application vendor to verify that this is
a valid Windows Installer package.
ERROR_INSTALL_PACKAGE_
INVALID 1620 This installation package could not be
opened. Contact the application vendor to
verify that this is a valid Windows
Installer package.
ERROR_INSTALL_UI_
FAILURE 1621 There was an error starting the Windows
Installer service user interface. Contact
your support personnel.
ERROR_INSTALL_LOG_
FAILURE 1622 Error opening installation log file.
Verify that the specified log file
location exists and is writable.
ERROR_INSTALL_LANGUAGE_
UNSUPPORTED 1623 This language of this installation package
is not supported by your system.
ERROR_INSTALL_PACKAGE_
REJECTED 1625 This installation is forbidden by system
policy. Contact your system administrator.
ERROR_FUNCTION_NOT_
CALLED 1626 Function could not be executed.
ERROR_FUNCTION_FAILED 1627 Function failed during execution.
ERROR_INVALID_TABLE 1628 Invalid or unknown table specified.
ERROR_DATATYPE_MISMATCH 1629 Data supplied is of wrong type.
ERROR_UNSUPPORTED_TYPE 1630 Data of this type is not supported.
ERROR_CREATE_FAILED 1631 The Windows Installer service failed to
start. Contact your support personnel.
ERROR_INSTALL_TEMP_

Nguồn: https://otrasnoviaxeiro.com/

Xem thêm bài viết: https://otrasnoviaxeiro.com/category/cong-nghe

Leave a Reply

Your email address will not be published. Required fields are marked *

Comments

Mar Lucres Lumain January 1, 2020 at 11:50 am

can't delete the corel

Reply

Mr. cookies January 1, 2020 at 11:50 am

thanks

Reply

wempel drempel January 1, 2020 at 11:50 am

thanks verry much mate it fixed my problem after i transferred a program from C: to D: i kept getting the error it works for everything aswell :DDD

Reply

The_Dragon2507 January 1, 2020 at 11:50 am

control + L just makes me change the "Computer" thing

Reply

yzarc movies January 1, 2020 at 11:50 am

Helped me more .Thanks bro i subscribed ur channel keep it up

Reply

Hlua Alex van Astria January 1, 2020 at 11:50 am

I cannot install any exe file and uninstall files from my computer
Please can you tell me how to fix this

Reply

Khan1 Khan1 January 1, 2020 at 11:50 am

the steps in this video are not fixing the following 4 different install errors in windows 10
1)Runtime Error (at 180:321);

SWbemLocator: The executable program that this service is configured to run

does not implement the service.

2)process id-0xb24(2852)

Click ok to terminate the application.

Click cancel to debug the application.

3)how to fix unable to create a temporary file. setup aborted.

Error 123:the filename, directory name or volume label syntax is incorrect.

4)Runtime error 216 at 00419321

5)installed Malwarebytes antimalware and when i ran it give the error "unable to connect the service"

if sfc/scannow and chkdsk can't fix them.

these steps aren't working.

Reply

William Fame January 1, 2020 at 11:50 am

Your instruction is helpful. Thank you very much.

Reply

Time Traveller January 1, 2020 at 11:50 am

Unable to delete

Reply

Time Traveller January 1, 2020 at 11:50 am

Unable to delete

Reply

Anthony Esteves Fararoni January 1, 2020 at 11:50 am

"unable to delete all specified values." HELP!

Reply

yamin mazumder January 1, 2020 at 11:50 am

Mera laptop mhe ek wifi diverse installed Kiya bad mhe display mhe restart now Aya bad mhe mene restart Kiya abi laptop on hoke fir off ho jata ha abi Kiya koruuu

Reply

yamin mazumder January 1, 2020 at 11:50 am

Mera ek halp koro

Reply

O yeah yeah Ohh yeah yeah January 1, 2020 at 11:50 am

this fucking works thanks man

Reply

Asim Khan January 1, 2020 at 11:50 am

Thank You Sir 🙂

Reply

Nilesh Khairnar January 1, 2020 at 11:50 am

thanks

Reply

Pandurang Deshmukh January 1, 2020 at 11:50 am

Thank you very much….this video helps me a lot and solve my alloc fatal error problem.

Reply

Stephan Putros January 1, 2020 at 11:50 am

How to
change the IP address of Sidexis?

Reply

Skilled Lover January 1, 2020 at 11:50 am

Why cant i install scripts and shit like that the Anti vīrus cancels all

Reply

Skilled Lover January 1, 2020 at 11:50 am

Umm hey

Reply

Jasson Stalone January 1, 2020 at 11:50 am

THANKS ALOT IT WORKS!!!!!!!!!!!!!!!!!! 14.08.2019

Reply

iiCuriosPhoenixii January 1, 2020 at 11:50 am

ok so this use to work for me but its not working for me anymore

Reply

Gaming With Biggie January 1, 2020 at 11:50 am

it dont work nigga

Reply

vishal kumar January 1, 2020 at 11:50 am

Hey my error is fatal non-UI error

Reply

ChitownSmokas January 1, 2020 at 11:50 am

Not specific enough

Reply

NISHARGA KABIR January 1, 2020 at 11:50 am

Thank you very much…
Its working

Reply

banjo pariah January 1, 2020 at 11:50 am

OMG!!!!!! THANK YOU!!! It din't work exactly the same, but when I entered the search it brought up folders of the software (Amplitube4) that I didn't know existed and I figured were preventing a fresh install of the software; triggering a RunTime Error (Unkown Constant @). Sure enough all I had to do was delete the folders and PRESTO my installer is working! Thanks Again!!!!

Reply

chandra aryo wibowo January 1, 2020 at 11:50 am

Can you help me for error 1711 please?

Reply

sarjan poudel January 1, 2020 at 11:50 am

my chrome isn't installing windows 10

Reply

Anil Kumar Gupta January 1, 2020 at 11:50 am

When I delete its show "unable to delete all specified values." Plz help

Reply

Leave a Reply

Your email address will not be published. Required fields are marked *